{"text_format":"1","workbook":"xlsx","n_sheets":16,"sheets":["GİRİŞ","yardım","vt1","TaslakProgr.","yazdır5","yazdır10","yazdır15","xx5","xx10","xx15","yönetim","nöbetyerleri","öğretmenler","dersdoldur","gözetmen","Sayfa1"],"not_rendered":{"charts":0,"images":11,"macros":1,"external_links":29,"defined_names":1382,"comments":2,"pivot_tables":0},"unopened":[{"sheet":"yardım","index":1,"reason":"not_a_worksheet"},{"sheet":"xx5","index":7,"reason":"not_a_worksheet"},{"sheet":"xx10","index":8,"reason":"not_a_worksheet"},{"sheet":"xx15","index":9,"reason":"not_a_worksheet"}],"bounds":{"document_bytes":16777216,"sheet_cells":100000,"rows_first":2000,"rows_last":500,"rows_between":2000,"halvings":0,"cell_chars":16384,"cell_head_chars":4096},"cells_cut":0,"cells_raw":0,"read":"whole","date_system":"1900"}

{"sheet":"GİRİŞ","index":0,"n_rows":18,"n_cols":26,"rows_kept":18,"cut":false,"hidden":false,"merged":[[4,25,6,28],[12,1,12,6],[12,8,12,9],[12,10,12,11],[12,12,12,13],[12,14,12,15],[12,16,12,17],[12,18,12,20],[12,21,12,23],[4,1,4,6],[4,8,4,21],[6,1,6,6],[6,8,6,21],[10,1,10,6],[8,1,8,6],[10,13,10,19],[17,15,17,20]]}
[6]
[8]
[null,"AYLIK NÖBET ÇİZELGESİ PROGRAMI",null,null,null,null,null,null,null,null,null,null,null,null,null,null,null,null,null,null,null,"nobet22.02",null,null,"KURUMUN LOGOSU 1"]
[]
[null,"Kurumun Resmi Adı",null,null,null,null,null,"seay","ÖZEL ÜSKÜDAR SINAV KİŞİSEL GELİŞİM KURSU",null,null,null,null,null,null,null,null,null,null,null,null,null,null,null,null,"Taşmadan Yerleştiriniz"]
[]
[null,"Nöbet Çizelgesi Başlığı",null,null,null,null,null,null,"SINAV KİŞİSEL GELİŞİM KURSU AYLIK NÖBET ÇİZELGESİ"]
[]
[null,"Program Başlama Tarihi",null,null,null,null,null,null,null,null,null,null,null,null,null,null,null,null,null,null,null,null,null,null,"Çizgi dışına taşırmadan yerleştiriniz"]
[]
[null,"Öğretmenlerin Aynı Gün İçindeki Nöbet Süreci",null,null,null,null,null,null,"Tüm Gün",null,null,1,null,"Sabah veya Öğlen Yarımşar Gün"]
[]
[null,"Kurumda Ders Yapılan Günler",null,null,null,null,null,null,"Pazartesi",null,"Salı",null,"Çarşamba",null,"Perşembe",null,"Cuma",null,"Etüt/Deneme",null,null,"Ders Yok"]
[null,null,null,null,null,null,null,null,"Ders yapılan günleri yazmak çin hücrelerdeki AÇILAN LİSTEYİ kullanabilirsiniz."]
[]
{"$rows_left_out":4}
{"sheet":"vt1","index":2,"n_rows":40,"n_cols":21,"rows_kept":40,"cut":false,"hidden":true,"merged":[[1,17,1,18],[27,2,27,4]]}
[null,null,"NÖBET GÖREV SAYILARI",null,null,null,null,null,null,null,20,6,3,7,null,null,null,{"$f":"INDEX(S3:S19,$S$1)","v":10},{"$f":"COUNTA(Tablo2[Nöbet Yeri Tanımı])","v":10}]
[null,null,"ÖĞRETMEN","Nöbet Sayısı",null,"Verilen Nöbet Toplamı",{"$f":"SUM(D3:D27)+SUM(G3:G27)","v":25},null,{"$f":"INDEX(I3:I40,GİRİŞ!$A$2)","v":"2022-06-28"},null,{"$f":"INDEX(K4:K34,K1)","v":20},{"$f":"INDEX(L4:L15,L1)","v":"Haziran"},{"$f":"INDEX(M5:M13,M1)","v":2022},{"$f":"INDEX(N4:N13,N1)","v":"Pazar"},null,"NÖBET SÜRECİ",null,"NÖBET YERİ SAYISI",null,null,"YÖNETİM KADROSU"]
[null,1,{"$f":"öğretmenler!G5","v":"Y.Sümeyye  Tari"},{"$f":"IF(öğretmenler!H5=0,\"\",öğretmenler!H5)","v":1},26,{"$f":"öğretmenler!G30","v":"Z.Eymen  Biyo"},{"$f":"IF(öğretmenler!H30=0,\"\",öğretmenler!H30)","v":""},1,{"$f":"I4-1","v":"2022-06-21"},null,"GÜNLER","AYLAR","YILLAR","HAFTA",null,"TAM GÜN",null,1,5,null,"Müdür"]
[null,2,{"$f":"öğretmenler!G6","v":"E.Beyza  Coğr"},{"$f":"IF(öğretmenler!H6=0,\"\",öğretmenler!H6)","v":1},27,{"$f":"öğretmenler!G31","v":"E.Burak  Türk"},{"$f":"IF(öğretmenler!H31=0,\"\",öğretmenler!H31)","v":1},2,"2022-06-22",null,1,"Ocak",{"$f":"YEAR(TODAY())","v":2022},"Pazartesi",null,"YARIM GÜN",null,2,5,null,"Müdür Baş Yardımcısı"]
[null,3,{"$f":"öğretmenler!G7","v":"M.Esma  Fizi"},{"$f":"IF(öğretmenler!H7=0,\"\",öğretmenler!H7)","v":1},28,{"$f":"öğretmenler!G32","v":"Y.Zeynep  TDE"},{"$f":"IF(öğretmenler!H32=0,\"\",öğretmenler!H32)","v":""},3,"2022-06-23",null,2,"Şubat",{"$f":"M4-2","v":2020},"Salı",null,"SABAH / ÖĞLEN",null,3,5,null,"Müdür Yardımcısı 1"]
[null,4,{"$f":"öğretmenler!G8","v":"Ö.Yusuf  Kimy"},{"$f":"IF(öğretmenler!H8=0,\"\",öğretmenler!H8)","v":6},29,{"$f":"öğretmenler!G33","v":"Z.Elif  Müzi"},{"$f":"IF(öğretmenler!H33=0,\"\",öğretmenler!H33)","v":1},4,"2022-06-24",null,3,"Mart",{"$f":"M5+1","v":2021},"Çarşamba",null,"Sadece SABAH",null,4,5,null,"Müdür Yardımcısı 2"]
[null,5,{"$f":"öğretmenler!G9","v":"Ö.Mustafa  Mate"},{"$f":"IF(öğretmenler!H9=0,\"\",öğretmenler!H9)","v":1},30,{"$f":"öğretmenler!G34","v":"E.Defne  Resi"},{"$f":"IF(öğretmenler!H34=0,\"\",öğretmenler!H34)","v":""},5,"2022-06-25",null,4,"Nisan",{"$f":"M6+1","v":2022},"Perşembe",null,"Sadece ÖĞLEN",null,5,5,null,"Müdür Yardımcısı 3"]
[null,6,{"$f":"öğretmenler!G10","v":"M.Mehmet  matT"},{"$f":"IF(öğretmenler!H10=0,\"\",öğretmenler!H10)","v":1},31,{"$f":"öğretmenler!G35","v":"M.Asel  İngi"},{"$f":"IF(öğretmenler!H35=0,\"\",öğretmenler!H35)","v":""},6,"2022-06-26",null,5,"Mayıs",2023,"Cuma",null,null,null,6,5,null,"Yerleşke Müdürü"]
[null,7,{"$f":"öğretmenler!G11","v":"K.Ahmet  matA"},{"$f":"IF(öğretmenler!H11=0,\"\",öğretmenler!H11)","v":2},32,{"$f":"öğretmenler!G36","v":"İ.Azra  Alma"},{"$f":"IF(öğretmenler!H36=0,\"\",öğretmenler!H36)","v":1},7,{"$f":"I10-1","v":"2022-06-27"},null,6,"Haziran",2024,"Cumartesi",null,{"$f":"IF(GİRİŞ!$L$11=2,\"TAM\",IF(GİRİŞ!$L$11=1,\"SABAH\"))","v":"SABAH"},null,7,10,null,"Koordinatör"]
[null,8,{"$f":"öğretmenler!G12","v":"M.Ömer  Sosy"},{"$f":"IF(öğretmenler!H12=0,\"\",öğretmenler!H12)","v":""},33,{"$f":"öğretmenler!G37","v":"F.Eylül  Mate"},{"$f":"IF(öğretmenler!H37=0,\"\",öğretmenler!H37)","v":""},8,{"$f":"TODAY()","v":"2022-06-28"},null,7,"Temmuz",2025,"Pazar",null,{"$f":"IF(GİRİŞ!$L$11=2,\"GÜN\",IF(GİRİŞ!$L$11=1,\"ÖĞLEN\"))","v":"ÖĞLEN"},null,8,10,null,"PDR (Rehberlik)"]
[null,9,{"$f":"öğretmenler!G13","v":"H.Berat  Fen "},{"$f":"IF(öğretmenler!H13=0,\"\",öğretmenler!H13)","v":""},34,{"$f":"öğretmenler!G38","v":"M.Ebrar  matT"},{"$f":"IF(öğretmenler!H38=0,\"\",öğretmenler!H38)","v":""},9,{"$f":"I10+1","v":"2022-06-29"},null,8,"Ağustos",2026,"Etüt/Deneme",null,null,null,9,10,null,"(Diğer)"]
[null,10,{"$f":"öğretmenler!G14","v":"A.Muhamme  Biyo"},{"$f":"IF(öğretmenler!H14=0,\"\",öğretmenler!H14)","v":""},35,{"$f":"öğretmenler!G39","v":"A.Asya  matA"},{"$f":"IF(öğretmenler!H39=0,\"\",öğretmenler!H39)","v":1},10,{"$f":"I11+1","v":"2022-06-30"},null,9,"Eylül",2027,"Ders Yok",null,null,null,10,10]
[null,11,{"$f":"öğretmenler!G15","v":"M.Furkan  Türk"},{"$f":"IF(öğretmenler!H15=0,\"\",öğretmenler!H15)","v":""},36,{"$f":"öğretmenler!G40","v":"R.Öykü  Mate"},{"$f":"IF(öğretmenler!H40=0,\"\",öğretmenler!H40)","v":""},11,"2022-07-01",null,10,"Ekim",2028,null,null,null,null,11,10]
[null,12,{"$f":"öğretmenler!G16","v":"A.Emirhan  TDE"},{"$f":"IF(öğretmenler!H16=0,\"\",öğretmenler!H16)","v":1},37,{"$f":"öğretmenler!G41","v":"E.Ecrin  matT"},{"$f":"IF(öğretmenler!H41=0,\"\",öğretmenler!H41)","v":""},12,"2022-07-02",null,11,"Kasım",null,null,null,null,null,12,15]
[null,13,{"$f":"öğretmenler!G17","v":"E.Enes  Müzi"},{"$f":"IF(öğretmenler!H17=0,\"\",öğretmenler!H17)","v":""},38,{"$f":"öğretmenler!G42","v":"B.Hiranur  matA"},{"$f":"IF(öğretmenler!H42=0,\"\",öğretmenler!H42)","v":""},13,"2022-07-03",null,12,"Aralık",null,null,null,null,null,13,15]
{"$rows_left_out":26}
{"sheet":"TaslakProgr.","index":3,"n_rows":47,"n_cols":11,"rows_kept":47,"cut":false,"hidden":true,"merged":[[33,2,34,2],[36,2,37,2],[39,2,40,2],[42,2,43,2],[45,2,46,2],[18,2,19,2],[21,2,22,2],[24,2,25,2],[27,2,28,2],[30,2,31,2],[3,2,4,2],[6,2,7,2],[9,2,10,2],[12,2,13,2],[15,2,16,2],[3,0,4,0],[3,1,4,1],[6,0,7,0],[6,1,7,1],[9,0,10,0],[9,1,10,1],[12,0,13,0],[12,1,13,1],[15,0,16,0],[15,1,16,1],[18,0,19,0],[18,1,19,1],[21,0,22,0],[21,1,22,1],[24,0,25,0],[24,1,25,1],[27,0,28,0],[27,1,28,1],[30,0,31,0],[30,1,31,1],[33,0,34,0],[33,1,34,1],[45,0,46,0],[45,1,46,1],[36,0,37,0],[36,1,37,1],[39,0,40,0],[39,1,40,1],[42,0,43,0],[42,1,43,1]]}
[4,null,null,null,null,null,null,null,null,null,{"$f":"INDEX(Tablo256[Kısa Adı ve Branşı],TaslakProgr.!$A$1,0)","v":"Ö.Yusuf  Kimy"}]
[null,null,null,"Günler",{"$f":"GİRİŞ!I13","v":"Pazartesi"},{"$f":"GİRİŞ!K13","v":"Salı"},{"$f":"GİRİŞ!M13","v":"Çarşamba"},{"$f":"GİRİŞ!O13","v":"Perşembe"},{"$f":"GİRİŞ!Q13","v":"Cuma"},{"$f":"GİRİŞ!S13","v":"Etüt/Deneme"},{"$f":"GİRİŞ!V13","v":"Ders Yok"}]
[null,null,null,"Nöb.\nYönetici","Nagihan ESKİPAZAR","Sefer YÜRÜK","Şeyma ÖZAYDIN","Nagihan ESKİPAZAR2","Sefer YÜRÜK2","Şeyma ÖZAYDIN2","Sefer YÜRÜK3"]
[1,{"$f":"IF(nöbetyerleri!C5=0,\"\",nöbetyerleri!C5)","v":"Nöbet Yeri 1"},1,{"$f":"IF(GİRİŞ!$L$11=2,\"TAM\",IF(GİRİŞ!$L$11=1,\"SABAH\"))","v":"SABAH"},null,null,"İ.Azra  Alma"]
[null,{"$f":"progbir","v":{"$error":"#REF!"}},null,{"$f":"IF(GİRİŞ!$L$11=2,\"TAM\",IF(GİRİŞ!$L$11=1,\"SABAH\"))","v":"SABAH"},null,"Ö.Yusuf  Kimy",null,null,"K.Ahmet  matA"]
[]
[{"$f":"A4+1","v":2},{"$f":"IF(nöbetyerleri!C6=0,\"\",nöbetyerleri!C6)","v":"Nöbet Yeri 2"},{"$f":"C4+1","v":2},{"$f":"'vt1'!P9","v":"SABAH"}]
[null,null,null,{"$f":"'vt1'!P10","v":"ÖĞLEN"},null,null,"E.Beyza  Coğr","K.Yağmur  Fen "]
[]
[{"$f":"A7+1","v":3},{"$f":"IF(nöbetyerleri!C7=0,\"\",nöbetyerleri!C7)","v":"Nöbet Yeri 3"},{"$f":"C7+1","v":3},{"$f":"'vt1'!P9","v":"SABAH"},null,null,null,"A.Ali  Resi","A.Asya  matA"]
[null,null,null,{"$f":"'vt1'!P10","v":"ÖĞLEN"},null,"A.Emirhan  TDE"]
[]
[{"$f":"A10+1","v":4},{"$f":"IF(nöbetyerleri!C8=0,\"\",nöbetyerleri!C8)","v":"Nöbet Yeri 4"},{"$f":"C10+1","v":4},{"$f":"'vt1'!P9","v":"SABAH"},null,null,null,null,"Y.Sümeyye  Tari"]
[null,null,null,{"$f":"'vt1'!P10","v":"ÖĞLEN"},null,"E.Burak  Türk"]
[]
{"$rows_left_out":33}
{"sheet":"yazdır5","index":4,"n_rows":30,"n_cols":11,"rows_kept":30,"cut":false,"hidden":true,"merged":[[0,1,0,8],[3,2,4,2],[6,2,7,2],[9,2,10,2],[12,2,13,2],[6,1,7,1],[12,1,13,1],[29,9,29,10],[15,2,16,2],[18,2,19,2],[21,2,22,2],[3,1,4,1],[9,1,10,1],[18,1,19,1],[21,1,22,1],[15,1,16,1],[25,9,25,10],[26,9,26,10],[27,9,27,10],[28,9,28,10]]}
[null,{"$f":"GİRİŞ!I7","v":"SINAV KİŞİSEL GELİŞİM KURSU AYLIK NÖBET ÇİZELGESİ"},null,null,null,null,null,null,null,"Başlama Tarihi:",{"$f":"'vt1'!I2","v":"2022-06-28"}]
[null,{"$f":"nöbetPlanAlanı","v":0},null,{"$f":"nöbetPlanAlanı","v":"Günler"},"Pazartesi","Salı","Çarşamba","Perşembe","Cuma","Etüt/Deneme","Ders Yok"]
[null,{"$f":"nöbetPlanAlanı","v":0},null,"Nöb.\nYönetici","Nagihan ESKİPAZAR","Sefer YÜRÜK","Şeyma ÖZAYDIN","Nagihan ESKİPAZAR2","Sefer YÜRÜK2","Şeyma ÖZAYDIN2","Sefer YÜRÜK3"]
[1,{"$f":"nöbetPlanAlanı","v":"Nöbet Yeri 1"},1,"SABAH",0,0,"İ.Azra  Alma",0,0,0,{"$f":"nöbetPlanAlanı","v":0}]
[null,{"$f":"NöbetGiriş1","v":{"$error":"#REF!"}},null,"SABAH",0,"Ö.Yusuf  Kimy",0,0,"K.Ahmet  matA",0,{"$f":"nöbetPlanAlanı","v":0}]
[]
[2,{"$f":"nöbetPlanAlanı","v":"Nöbet Yeri 2"},{"$f":"C4+1","v":2},{"$f":"nöbetPlanAlanı","v":"SABAH"},0,0,0,0,0,{"$f":"nöbetPlanAlanı","v":0},0]
[null,{"$error":"#REF!"},null,"ÖĞLEN",0,0,"E.Beyza  Coğr","K.Yağmur  Fen ",0,0,0]
[]
[3,{"$f":"nöbetPlanAlanı","v":"Nöbet Yeri 3"},{"$f":"C7+1","v":3},{"$f":"nöbetPlanAlanı","v":"SABAH"},0,0,0,"A.Ali  Resi","A.Asya  matA",0,0]
[null,{"$error":"#REF!"},null,"ÖĞLEN",0,"A.Emirhan  TDE",0,0,0,0,0]
[]
[4,{"$f":"nöbetPlanAlanı","v":"Nöbet Yeri 4"},{"$f":"C10+1","v":4},{"$f":"nöbetPlanAlanı","v":"SABAH"},0,0,0,0,"Y.Sümeyye  Tari",0,0]
[null,{"$error":"#REF!"},null,"ÖĞLEN",0,"E.Burak  Türk",0,0,0,0,0]
[]
{"$rows_left_out":16}
{"sheet":"yazdır10","index":5,"n_rows":46,"n_cols":11,"rows_kept":46,"cut":false,"hidden":true,"merged":[[0,1,0,8],[3,2,4,2],[6,2,7,2],[9,2,10,2],[12,2,13,2],[1,1,1,2],[2,1,2,2],[3,1,4,1],[9,1,10,1],[6,1,7,1],[12,1,13,1],[30,1,31,1],[33,1,34,1],[36,1,37,1],[15,1,16,1],[21,1,22,1],[18,1,19,1],[24,1,25,1],[27,1,28,1],[42,9,42,10],[43,9,43,10],[44,9,44,10],[45,9,45,10],[15,2,16,2],[18,2,19,2],[21,2,22,2],[24,2,25,2],[27,2,28,2],[30,2,31,2],[33,2,34,2],[36,2,37,2],[41,9,41,10]]}
[null,{"$f":"GİRİŞ!I7","v":"SINAV KİŞİSEL GELİŞİM KURSU AYLIK NÖBET ÇİZELGESİ"},null,null,null,null,null,null,null,"Başlama Tarihi:",{"$f":"'vt1'!I2","v":"2022-06-28"}]
[null,{"$f":"nöbetPlanAlanı","v":0},null,{"$f":"nöbetPlanAlanı","v":"Günler"},"Pazartesi","Salı","Çarşamba","Perşembe","Cuma","Etüt/Deneme","Ders Yok"]
[null,{"$f":"nöbetPlanAlanı","v":0},null,"Nöb.\nYönetici","Nagihan ESKİPAZAR","Sefer YÜRÜK","Şeyma ÖZAYDIN","Nagihan ESKİPAZAR2","Sefer YÜRÜK2","Şeyma ÖZAYDIN2","Sefer YÜRÜK3"]
[1,{"$f":"nöbetPlanAlanı","v":"Nöbet Yeri 1"},1,"SABAH",0,0,"İ.Azra  Alma",0,0,0,0]
[null,{"$f":"NöbetGiriş1","v":{"$error":"#REF!"}},null,"SABAH",0,"Ö.Yusuf  Kimy",0,0,"K.Ahmet  matA",0,0]
[]
[2,{"$f":"nöbetPlanAlanı","v":"Nöbet Yeri 2"},{"$f":"C4+1","v":2},{"$f":"nöbetPlanAlanı","v":"SABAH"},0,0,0,0,0,0,0]
[null,{"$error":"#REF!"},null,"ÖĞLEN",0,0,"E.Beyza  Coğr","K.Yağmur  Fen ",0,0,0]
[]
[3,{"$f":"nöbetPlanAlanı","v":"Nöbet Yeri 3"},{"$f":"C7+1","v":3},{"$f":"nöbetPlanAlanı","v":"SABAH"},0,0,0,"A.Ali  Resi","A.Asya  matA",0,0]
[null,{"$error":"#REF!"},null,"ÖĞLEN",0,"A.Emirhan  TDE",0,0,0,0,0]
[]
[4,{"$f":"nöbetPlanAlanı","v":"Nöbet Yeri 4"},{"$f":"C10+1","v":4},{"$f":"nöbetPlanAlanı","v":"SABAH"},0,0,0,0,"Y.Sümeyye  Tari",0,0]
[null,{"$error":"#REF!"},null,"ÖĞLEN",0,"E.Burak  Türk",0,0,0,0,0]
[]
{"$rows_left_out":32}
{"sheet":"yazdır15","index":6,"n_rows":54,"n_cols":11,"rows_kept":54,"cut":false,"hidden":true,"merged":[[30,2,31,2],[33,2,34,2],[36,2,37,2],[39,2,40,2],[42,2,43,2],[0,1,0,8],[3,2,4,2],[6,2,7,2],[9,2,10,2],[12,2,13,2],[1,1,1,2],[2,1,2,2],[15,2,16,2],[18,2,19,2],[21,2,22,2],[24,2,25,2],[27,2,28,2],[30,1,31,1],[3,1,4,1],[6,1,7,1],[9,1,10,1],[12,1,13,1],[15,1,16,1],[18,1,19,1],[21,1,22,1],[24,1,25,1],[27,1,28,1],[53,9,53,10],[33,1,34,1],[36,1,37,1],[39,1,40,1],[42,1,43,1],[45,1,46,1],[45,2,46,2],[49,9,49,10],[50,9,50,10],[51,9,51,10],[52,9,52,10]]}
[null,{"$f":"GİRİŞ!I7","v":"SINAV KİŞİSEL GELİŞİM KURSU AYLIK NÖBET ÇİZELGESİ"},null,null,null,null,null,null,null,"Başlama Tarihi:",{"$f":"'vt1'!I2","v":"2022-06-28"}]
[null,{"$f":"nöbetPlanAlanı","v":0},null,{"$f":"nöbetPlanAlanı","v":"Günler"},"Pazartesi","Salı","Çarşamba","Perşembe","Cuma","Etüt/Deneme","Ders Yok"]
[null,{"$f":"nöbetPlanAlanı","v":0},null,"Nöb.\nYönetici","Nagihan ESKİPAZAR","Sefer YÜRÜK","Şeyma ÖZAYDIN","Nagihan ESKİPAZAR2","Sefer YÜRÜK2","Şeyma ÖZAYDIN2","Sefer YÜRÜK3"]
[1,{"$f":"nöbetPlanAlanı","v":"Nöbet Yeri 1"},1,"SABAH",0,0,"İ.Azra  Alma",0,0,0,0]
[null,{"$f":"NöbetGiriş1","v":{"$error":"#REF!"}},null,"SABAH",0,"Ö.Yusuf  Kimy",0,0,"K.Ahmet  matA",0,0]
[]
[2,{"$f":"nöbetPlanAlanı","v":"Nöbet Yeri 2"},{"$f":"C4+1","v":2},{"$f":"nöbetPlanAlanı","v":"SABAH"},0,0,0,0,0,0,0]
[null,{"$error":"#REF!"},null,"ÖĞLEN",0,0,"E.Beyza  Coğr","K.Yağmur  Fen ",0,0,0]
[]
[3,{"$f":"nöbetPlanAlanı","v":"Nöbet Yeri 3"},{"$f":"C7+1","v":3},{"$f":"nöbetPlanAlanı","v":"SABAH"},0,0,0,"A.Ali  Resi","A.Asya  matA",0,0]
[null,{"$error":"#REF!"},null,"ÖĞLEN",0,"A.Emirhan  TDE",0,0,0,0,0]
[]
[4,{"$f":"nöbetPlanAlanı","v":"Nöbet Yeri 4"},{"$f":"C10+1","v":4},{"$f":"nöbetPlanAlanı","v":"SABAH"},0,0,0,0,"Y.Sümeyye  Tari",0,0]
[null,{"$error":"#REF!"},null,"ÖĞLEN",0,"E.Burak  Türk",0,0,0,0,0]
[]
{"$rows_left_out":40}
{"sheet":"yönetim","index":10,"n_rows":16,"n_cols":4,"rows_kept":16,"cut":false,"hidden":true,"merged":[]}
[]
[]
[null,"KURUM BİLGİLERİ"]
[null,"Sıra No","Pozisyonu","Adı Soyadı"]
[null,1,"Müdür","Nagihan ESKİPAZAR"]
[null,{"$f":"IF(Tablo25[[#This Row],[Pozisyonu]]=0,\"\",IF(LEN(Tablo25[[#This Row],[Pozisyonu]])>1,(LARGE($B$5:B5,1)+1),\"\"))","v":2},"Müdür Baş Yardımcısı","Sefer YÜRÜK"]
[null,{"$f":"IF(Tablo25[[#This Row],[Pozisyonu]]=0,\"\",IF(LEN(Tablo25[[#This Row],[Pozisyonu]])>1,(LARGE($B$5:B6,1)+1),\"\"))","v":3},"Müdür Yardımcısı 2"]
[null,{"$f":"IF(Tablo25[[#This Row],[Pozisyonu]]=0,\"\",IF(LEN(Tablo25[[#This Row],[Pozisyonu]])>1,(LARGE($B$5:B7,1)+1),\"\"))","v":4},"Yerleşke Müdürü"]
[null,{"$f":"IF(Tablo25[[#This Row],[Pozisyonu]]=0,\"\",IF(LEN(Tablo25[[#This Row],[Pozisyonu]])>1,(LARGE($B$5:B8,1)+1),\"\"))","v":5},"Koordinatör"]
[null,{"$f":"IF(Tablo25[[#This Row],[Pozisyonu]]=0,\"\",IF(LEN(Tablo25[[#This Row],[Pozisyonu]])>1,(LARGE($B$5:B9,1)+1),\"\"))","v":6},"PDR (Rehberlik)","Şeyma ÖZAYDIN"]
[null,{"$f":"IF(Tablo25[[#This Row],[Pozisyonu]]=0,\"\",IF(LEN(Tablo25[[#This Row],[Pozisyonu]])>1,(LARGE($B$5:B10,1)+1),\"\"))","v":7},"(Diğer)"]
[null,{"$f":"IF(Tablo25[[#This Row],[Pozisyonu]]=0,\"\",IF(LEN(Tablo25[[#This Row],[Pozisyonu]])>1,(LARGE($B$5:B11,1)+1),\"\"))","v":""}]
[null,{"$f":"IF(Tablo25[[#This Row],[Pozisyonu]]=0,\"\",IF(LEN(Tablo25[[#This Row],[Pozisyonu]])>1,(LARGE($B$5:B12,1)+1),\"\"))","v":""}]
[null,{"$f":"IF(Tablo25[[#This Row],[Pozisyonu]]=0,\"\",IF(LEN(Tablo25[[#This Row],[Pozisyonu]])>1,(LARGE($B$5:B13,1)+1),\"\"))","v":""}]
[null,{"$f":"IF(Tablo25[[#This Row],[Pozisyonu]]=0,\"\",IF(LEN(Tablo25[[#This Row],[Pozisyonu]])>1,(LARGE($B$5:B14,1)+1),\"\"))","v":""}]
{"$rows_left_out":2}
{"sheet":"nöbetyerleri","index":11,"n_rows":19,"n_cols":4,"rows_kept":19,"cut":false,"hidden":true,"merged":[]}
[]
[]
[null,"NÖBET LANLARI"]
[null,"Sıra No","Nöbet Yeri Tanımı","Açıklama"]
[null,"Nöbet Yeri 1","Nöbet Yeri 1"]
[null,"Nöbet Yeri 2","Nöbet Yeri 2"]
[null,"Nöbet Yeri 3","Nöbet Yeri 3"]
[null,"Nöbet Yeri 4","Nöbet Yeri 4"]
[null,"Nöbet Yeri 5","Nöbet Yeri 5"]
[null,"Nöbet Yeri 6","Nöbet Yeri 4"]
[null,"Nöbet Yeri 7","Nöbet Yeri 5"]
[null,"Nöbet Yeri 8","Nöbet Yeri 4"]
[null,"Nöbet Yeri 9","Nöbet Yeri 5"]
[null,"Nöbet Yeri 10","Karşılama\nUğurlama","Güvenlik, halkla ilişkiler, yönetici veya nöbetçi öğretmenler…"]
[null,"Nöbet Yeri 11"]
{"$rows_left_out":5}
{"sheet":"öğretmenler","index":12,"n_rows":54,"n_cols":8,"rows_kept":54,"cut":false,"hidden":true,"merged":[]}
[]
[]
[null,"KURUM BİLGİLERİ"]
[null,"Sıra No","Adı","Soyadı","Branşı","Tam Adı","Kısa Adı ve Branşı","Görev\nSayısı"]
[1,1,"Yusuf","Sümeyye","Tarih",{"$f":"CONCATENATE(Tablo256[[#This Row],[Adı]],\" \",Tablo256[[#This Row],[Soyadı]])","v":"Yusuf Sümeyye"},{"$f":"CONCATENATE(LEFT(Tablo256[[#This Row],[Adı]],1),\".\",LEFT(Tablo256[[#This Row],[Soyadı]],7),\"  \",LEFT(Tablo256[[#This Row],[Branşı]],4))","v":"Y.Sümeyye  Tari"},{"$f":"COUNTIF(TaslakProgr.!D$2:K$47,Tablo256[[#This Row],[Kısa Adı ve Branşı]])","v":1}]
[2,{"$f":"IF(Tablo256[[#This Row],[Adı]]=0,\"\",IF(LEN(Tablo256[[#This Row],[Adı]])>1,(LARGE($B$5:B5,1)+1),\"\"))","v":2},"Eymen","Beyza","Coğrafya",{"$f":"CONCATENATE(Tablo256[[#This Row],[Adı]],\" \",Tablo256[[#This Row],[Soyadı]])","v":"Eymen Beyza"},{"$f":"CONCATENATE(LEFT(Tablo256[[#This Row],[Adı]],1),\".\",LEFT(Tablo256[[#This Row],[Soyadı]],7),\"  \",LEFT(Tablo256[[#This Row],[Branşı]],4))","v":"E.Beyza  Coğr"},{"$f":"COUNTIF(TaslakProgr.!D$2:K$47,Tablo256[[#This Row],[Kısa Adı ve Branşı]])","v":1}]
[3,{"$f":"IF(Tablo256[[#This Row],[Adı]]=0,\"\",IF(LEN(Tablo256[[#This Row],[Adı]])>1,(LARGE($B$5:B6,1)+1),\"\"))","v":3},"Miraç","Esma","Fizik",{"$f":"CONCATENATE(Tablo256[[#This Row],[Adı]],\" \",Tablo256[[#This Row],[Soyadı]])","v":"Miraç Esma"},{"$f":"CONCATENATE(LEFT(Tablo256[[#This Row],[Adı]],1),\".\",LEFT(Tablo256[[#This Row],[Soyadı]],7),\"  \",LEFT(Tablo256[[#This Row],[Branşı]],4))","v":"M.Esma  Fizi"},{"$f":"COUNTIF(TaslakProgr.!D$2:K$47,Tablo256[[#This Row],[Kısa Adı ve Branşı]])","v":1}]
[4,{"$f":"IF(Tablo256[[#This Row],[Adı]]=0,\"\",IF(LEN(Tablo256[[#This Row],[Adı]])>1,(LARGE($B$5:B7,1)+1),\"\"))","v":4},"ÖmerAsaf","Yusuf","Kimya",{"$f":"CONCATENATE(Tablo256[[#This Row],[Adı]],\" \",Tablo256[[#This Row],[Soyadı]])","v":"ÖmerAsaf Yusuf"},{"$f":"CONCATENATE(LEFT(Tablo256[[#This Row],[Adı]],1),\".\",LEFT(Tablo256[[#This Row],[Soyadı]],7),\"  \",LEFT(Tablo256[[#This Row],[Branşı]],4))","v":"Ö.Yusuf  Kimy"},{"$f":"COUNTIF(TaslakProgr.!D$2:K$47,Tablo256[[#This Row],[Kısa Adı ve Branşı]])","v":6}]
[5,{"$f":"IF(Tablo256[[#This Row],[Adı]]=0,\"\",IF(LEN(Tablo256[[#This Row],[Adı]])>1,(LARGE($B$5:B8,1)+1),\"\"))","v":5},"Ömer","Mustafa","Matematik",{"$f":"CONCATENATE(Tablo256[[#This Row],[Adı]],\" \",Tablo256[[#This Row],[Soyadı]])","v":"Ömer Mustafa"},{"$f":"CONCATENATE(LEFT(Tablo256[[#This Row],[Adı]],1),\".\",LEFT(Tablo256[[#This Row],[Soyadı]],7),\"  \",LEFT(Tablo256[[#This Row],[Branşı]],4))","v":"Ö.Mustafa  Mate"},{"$f":"COUNTIF(TaslakProgr.!D$2:K$47,Tablo256[[#This Row],[Kısa Adı ve Branşı]])","v":1}]
[6,{"$f":"IF(Tablo256[[#This Row],[Adı]]=0,\"\",IF(LEN(Tablo256[[#This Row],[Adı]])>1,(LARGE($B$5:B9,1)+1),\"\"))","v":6},"Mustafa","Mehmet","matTYT",{"$f":"CONCATENATE(Tablo256[[#This Row],[Adı]],\" \",Tablo256[[#This Row],[Soyadı]])","v":"Mustafa Mehmet"},{"$f":"CONCATENATE(LEFT(Tablo256[[#This Row],[Adı]],1),\".\",LEFT(Tablo256[[#This Row],[Soyadı]],7),\"  \",LEFT(Tablo256[[#This Row],[Branşı]],4))","v":"M.Mehmet  matT"},{"$f":"COUNTIF(TaslakProgr.!D$2:K$47,Tablo256[[#This Row],[Kısa Adı ve Branşı]])","v":1}]
[7,{"$f":"IF(Tablo256[[#This Row],[Adı]]=0,\"\",IF(LEN(Tablo256[[#This Row],[Adı]])>1,(LARGE($B$5:B10,1)+1),\"\"))","v":7},"Kerem","Ahmet","matAYT",{"$f":"CONCATENATE(Tablo256[[#This Row],[Adı]],\" \",Tablo256[[#This Row],[Soyadı]])","v":"Kerem Ahmet"},{"$f":"CONCATENATE(LEFT(Tablo256[[#This Row],[Adı]],1),\".\",LEFT(Tablo256[[#This Row],[Soyadı]],7),\"  \",LEFT(Tablo256[[#This Row],[Branşı]],4))","v":"K.Ahmet  matA"},{"$f":"COUNTIF(TaslakProgr.!D$2:K$47,Tablo256[[#This Row],[Kısa Adı ve Branşı]])","v":2}]
[8,{"$f":"IF(Tablo256[[#This Row],[Adı]]=0,\"\",IF(LEN(Tablo256[[#This Row],[Adı]])>1,(LARGE($B$5:B11,1)+1),\"\"))","v":8},"Miran","Ömer","Sosyal Bilgl",{"$f":"CONCATENATE(Tablo256[[#This Row],[Adı]],\" \",Tablo256[[#This Row],[Soyadı]])","v":"Miran Ömer"},{"$f":"CONCATENATE(LEFT(Tablo256[[#This Row],[Adı]],1),\".\",LEFT(Tablo256[[#This Row],[Soyadı]],7),\"  \",LEFT(Tablo256[[#This Row],[Branşı]],4))","v":"M.Ömer  Sosy"},{"$f":"COUNTIF(TaslakProgr.!D$2:K$47,Tablo256[[#This Row],[Kısa Adı ve Branşı]])","v":0}]
[9,{"$f":"IF(Tablo256[[#This Row],[Adı]]=0,\"\",IF(LEN(Tablo256[[#This Row],[Adı]])>1,(LARGE($B$5:B12,1)+1),\"\"))","v":9},"Hamza","Berat","Fen Bilimleri",{"$f":"CONCATENATE(Tablo256[[#This Row],[Adı]],\" \",Tablo256[[#This Row],[Soyadı]])","v":"Hamza Berat"},{"$f":"CONCATENATE(LEFT(Tablo256[[#This Row],[Adı]],1),\".\",LEFT(Tablo256[[#This Row],[Soyadı]],7),\"  \",LEFT(Tablo256[[#This Row],[Branşı]],4))","v":"H.Berat  Fen "},{"$f":"COUNTIF(TaslakProgr.!D$2:K$47,Tablo256[[#This Row],[Kısa Adı ve Branşı]])","v":0}]
[10,{"$f":"IF(Tablo256[[#This Row],[Adı]]=0,\"\",IF(LEN(Tablo256[[#This Row],[Adı]])>1,(LARGE($B$5:B13,1)+1),\"\"))","v":10},"Ahmet","Muhammed","Biyoloji",{"$f":"CONCATENATE(Tablo256[[#This Row],[Adı]],\" \",Tablo256[[#This Row],[Soyadı]])","v":"Ahmet Muhammed"},{"$f":"CONCATENATE(LEFT(Tablo256[[#This Row],[Adı]],1),\".\",LEFT(Tablo256[[#This Row],[Soyadı]],7),\"  \",LEFT(Tablo256[[#This Row],[Branşı]],4))","v":"A.Muhamme  Biyo"},{"$f":"COUNTIF(TaslakProgr.!D$2:K$47,Tablo256[[#This Row],[Kısa Adı ve Branşı]])","v":0}]
[11,{"$f":"IF(Tablo256[[#This Row],[Adı]]=0,\"\",IF(LEN(Tablo256[[#This Row],[Adı]])>1,(LARGE($B$5:B14,1)+1),\"\"))","v":11},"Mehmet","Furkan","Türkçe",{"$f":"CONCATENATE(Tablo256[[#This Row],[Adı]],\" \",Tablo256[[#This Row],[Soyadı]])","v":"Mehmet Furkan"},{"$f":"CONCATENATE(LEFT(Tablo256[[#This Row],[Adı]],1),\".\",LEFT(Tablo256[[#This Row],[Soyadı]],7),\"  \",LEFT(Tablo256[[#This Row],[Branşı]],4))","v":"M.Furkan  Türk"},{"$f":"COUNTIF(TaslakProgr.!D$2:K$47,Tablo256[[#This Row],[Kısa Adı ve Branşı]])","v":0}]
{"$rows_left_out":40}
{"sheet":"dersdoldur","index":13,"n_rows":5,"n_cols":7,"rows_kept":5,"cut":false,"hidden":true,"merged":[[2,1,2,4],[2,6,2,18]]}
[]
[]
[null,{"$f":"GİRİŞ!B5","v":"Kurumun Resmi Adı"},null,null,null,null,{"$f":"GİRİŞ!I5","v":"ÖZEL ÜSKÜDAR SINAV KİŞİSEL GELİŞİM KURSU"}]
[]
[null,null,null,"Bu sayfaya, boş geçen derslerle ilgili günlük görevlendirme tablosu eklenecektir."]

{"sheet":"gözetmen","index":14,"n_rows":6,"n_cols":7,"rows_kept":6,"cut":false,"hidden":true,"merged":[[2,1,2,4],[2,6,2,18]]}
[]
[]
[null,{"$f":"GİRİŞ!B5","v":"Kurumun Resmi Adı"},null,null,null,null,{"$f":"GİRİŞ!I5","v":"ÖZEL ÜSKÜDAR SINAV KİŞİSEL GELİŞİM KURSU"}]
[]
[]
[null,null,null,"Bu sayfaya; deneme sınavları yönergesi ile sınavlarda görevli gözetmen tablosu eklenecektir."]

{"sheet":"Sayfa1","index":15,"n_rows":9,"n_cols":8,"rows_kept":9,"cut":false,"hidden":true,"merged":[]}
[]
[]
[]
[]
[]
[]
[]
[]
[null,null,null,null,"Daha fazlası:",null,null,"Daha fazlası: www.iyiorneklerlisesi.com"]